Conceptual Level
type: Class
comment: The Conceptual Level classifies concepts describing the conceptual views of the enterprise.The conceptual view is independant of any commitment to physical resources.
subclass of: 52b05a616a104fab